{"text_format":"1","workbook":"xlsx","n_sheets":4,"sheets":["Captura","calendario","Datos","Listas"],"not_rendered":{"charts":0,"images":5,"macros":1,"external_links":0,"defined_names":7,"comments":0,"pivot_tables":0},"unopened":[],"bounds":{"document_bytes":16777216,"sheet_cells":100000,"rows_first":2000,"rows_last":500,"rows_between":2000,"halvings":0,"cell_chars":16384,"cell_head_chars":4096},"cells_cut":0,"cells_raw":0,"read":"whole","date_system":"1900"}

{"sheet":"Captura","index":0,"n_rows":27,"n_cols":6,"rows_kept":27,"cut":false,"hidden":false,"merged":[[14,5,16,5],[1,1,1,6]]}
[]
[null,"                       RECALENDARIZACIÓN DE HORAS"]
[]
[]
[null,null,"1. INSTITUCIÓN EDUCATIVA (Seleccione de la lista)",null,null,"3. Total de horas programadas - 2015 \n(Elija de acuerdo a su nivel)"]
[]
[]
[null,null,"1.1. CODIGO MODULAR \n(No digite nada en este campo, se autocompletará)",null,null,"4. Horas acumuladas a la fecha (Escriba solo dígitos)"]
[null,null,{"$f":"VLOOKUP($C$6,Listas!A:E,4,FALSE)","v":{"$error":"#N/A"}}]
[]
[null,null,"1.2. CODIGO DE LOCAL\n(No digite nada en este campo, se autocompletará)",null,null,"5. Horas reprogramadas (haga clic en el icono)"]
[null,null,{"$f":"VLOOKUP($C$6,Listas!A:E,5,FALSE)","v":{"$error":"#N/A"}},null,null,{"$f":"calendario!AP10","v":0}]
[null,null,null,null,null,"                         "]
[null,null,"2. Fecha programada para el  término de clases",null,null,"6. Comentarios / Observaciones"]
[]
[]
[null,null,"Instrumento elaborado por el Equipo de Estadística y Monitoreo de la Direccion Regional de Lima Metropolitana - 2015"]
[]
[null,null,"INSTRUCCIONES"]
[null,null,"1. Elija su Institución Educativa"]
[null,null,"2. Seleccione la fecha programada para el témino de clases"]
[null,null,"3. Seleccione el total de horas programadas para el presente año"]
[null,null,"4. Escriba la cantidad de horas acumuladas hasta la fecha de hoy"]
[null,null,"5. Haga clic en el ícono de la lupa para seleccionar las horas reprogra-"]
[null,null,"    madas."]
[null,null,"6. Agregue comentarios (OPCIONAL) y haga clic en GUARDAR DATOS."]
[null,null,"7. Cualquier consulta, escríbanos a monitoreo@drelm.gob.pe"]

{"sheet":"calendario","index":1,"n_rows":17,"n_cols":42,"rows_kept":17,"cut":false,"hidden":false,"merged":[[6,0,6,2],[7,37,7,39],[9,37,9,39],[3,40,3,41],[5,40,5,41],[3,0,3,1],[4,0,4,2],[5,0,5,1],[0,0,0,41],[1,0,2,2],[1,3,1,9],[1,10,1,16],[1,17,1,23],[1,24,1,30],[1,31,1,37],[1,38,1,39],[1,41,2,41],[1,40,2,40]]}
["RECALENDARIZACIÓN"]
["MES",null,null,"Semana 1",null,null,null,null,null,null,"Semana 2",null,null,null,null,null,null,"Semana 3",null,null,null,null,null,null,"Semana 4",null,null,null,null,null,null,"Semana 5",null,null,null,null,null,null,"Semana 6",null,"N° Horas","N° días"]
[null,null,null,"L","Ma","Mi","J","V","S","D","L","Ma","Mi","J","V","S","D","L","Ma","Mi","J","V","S","D","L","Ma","Mi","J","V","S","D","L","Ma","Mi","J","V","S","D","L","Ma"]
["NOVIEMBRE",null,"Fecha",null,null,null,null,null,null,1,2,3,4,5,6,7,8,9,10,11,12,13,14,15,16,17,18,19,20,21,22,23,24,25,26,27,28,29,30]
["(cantidad de horas)",null,null,null,null,null,null,null,null,null,null,null,null,null,null,null,null,null,null,null,null,null,null,null,null,null,null,null,null,null,null,null,null,null,null,null,null,null,null,null,{"$f":"SUM(D5:AM5)","v":0},{"$f":"COUNT(D5:AN5,D7:AN7)","v":0}]
["DICIEMBRE",null,"Fecha",null,1,2,3,4,5,6,7,8,9,10,11,12,13,14,15,16,17,18,19,20,21,22,23,24,25,26,27,28,29,30,31]
["(cantidad de horas)",null,null,null,null,null,null,null,null,null,null,null,null,null,null,null,null,null,null,null,null,null,null,null,null,null,null,null,null,null,null,null,null,null,null,null,null,null,null,null,{"$f":"SUM(D7:AM7)","v":0},{"$f":"COUNT(D7:AN7)","v":0}]
[null,null,null,null,null,null,null,null,null,null,null,null,null,null,null,null,null,null,null,null,null,null,null,null,null,null,null,null,null,null,null,null,null,null,null,null,null,"Total de días",null,null,null,{"$f":"SUM(AP5:AP7)","v":0}]
[null,null,null,"INSTRUCCIONES:"]
[null,null,null,"1. Escriba debajo de la fecha de los días por reprogramar ",null,null,null,null,null,null,null,null,null,null,null,null,null,null,null,null,null,null,null,null,null,null,null,null,null,null,null,null,null,null,null,null,null,"Total de Horas",null,null,null,{"$f":"SUM(AO4:AO7)","v":0}]
[null,null,null,"la cantidad de horas que se reprogramarán."]
[null,null,null,"Ej. ","día",null,"   D"]
[null,null,null,null,"fecha",null,15]
[null,null,null,null,"# horas",null,8]
[null,null,null,"2. El sistema calculará la cantidad de días y horas a recuperar,"]
[null,null,null,"una vez que ha completado la reclaendarización, haga clic en"]
[null,null,null,"el ícono Regresar a formulario."]

{"sheet":"Datos","index":2,"n_rows":1,"n_cols":10,"rows_kept":1,"cut":false,"hidden":false,"merged":[]}
["HORA DE REGISTRO","DIA DE REGISTRO","INSTITUCION EDUCATIVA","COD_MODULAR","COD_LOCAL","FECHA PROGRAMADA DE CIERRE","TOTAL DE HORAS PROGRAMADAS","HORAS ACUMULADAS","Horas a recuperar","Comentarios"]

{"sheet":"Listas","index":3,"n_rows":529,"n_cols":8,"rows_kept":529,"cut":false,"hidden":true,"merged":[]}
["INSTITUCIONES","N°","UGEL","COD_MOD","COD_LOC","NIVEL","Distrito","horas"]
["6023 - Secundaria",1,"UGEL San Juan de Miraflores 01","0583088","315000","Secundaria","Lurin",900]
["6023 - Primaria",1,"UGEL San Juan de Miraflores 01","0329060","315000","Primaria","Lurin",950]
["7267 SEÑOR DE LOS MILAGROS - Inicial - Jardín",2,"UGEL San Juan de Miraflores 01","1475748","687887","Inicial - Jardín","Lurin",1100]
["7267 SEÑOR DE LOS MILAGROS - Primaria",2,"UGEL San Juan de Miraflores 01","1475755","687887","Primaria","Lurin",1200]
["7267 SEÑOR DE LOS MILAGROS - Secundaria",2,"UGEL San Juan de Miraflores 01","1279124","687887","Secundaria","Lurin",1300]
["669 - Inicial - Jardín",3,"UGEL San Juan de Miraflores 01","0868950","318150","Inicial - Jardín","Pachacamac",1400]
["670 - Inicial - Jardín",4,"UGEL San Juan de Miraflores 01","0868984","318169","Inicial - Jardín","Pachacamac",1600]
["6055 VIRGEN DE FATIMA - Primaria",5,"UGEL San Juan de Miraflores 01","0328310","318188","Primaria","Pachacamac"]
["6055 VIRGEN DE FATIMA - Inicial - Jardín",5,"UGEL San Juan de Miraflores 01","1475540","318188","Inicial - Jardín","Pachacamac"]
["7260 SEÑOR DE LOS MILAGROS - Primaria",6,"UGEL San Juan de Miraflores 01","0763458","318287","Primaria","Pachacamac"]
["7260 SEÑOR DE LOS MILAGROS - Secundaria",6,"UGEL San Juan de Miraflores 01","1477249","318287","Secundaria","Pachacamac"]
["7261 SANTA ROSA DE COLLANAC - Primaria",7,"UGEL San Juan de Miraflores 01","0777227","318292","Primaria","Pachacamac"]
["7261 SANTA ROSA DE COLLANAC - Secundaria",7,"UGEL San Juan de Miraflores 01","1241678","318292","Secundaria","Pachacamac"]
["7261 SANTA ROSA DE COLLANAC - Inicial - Jardín",7,"UGEL San Juan de Miraflores 01","1518737","318292","Inicial - Jardín","Pachacamac"]
["7266 LAS MERCEDES - Primaria",8,"UGEL San Juan de Miraflores 01","1474899","687528","Primaria","Pachacamac"]
["7266 LAS MERCEDES - Secundaria",8,"UGEL San Juan de Miraflores 01","1393453","687528","Secundaria","Pachacamac"]
["7265 - Primaria",9,"UGEL San Juan de Miraflores 01","1055839","687533","Primaria","Pachacamac"]
["7265 - Secundaria",9,"UGEL San Juan de Miraflores 01","1475599","687533","Secundaria","Pachacamac"]
["675 LAS MERCEDES - Inicial - Jardín",10,"UGEL San Juan de Miraflores 01","1476878","688405","Inicial - Jardín","Pachacamac"]
["6151 SAN LUIS GONZAGA - Primaria",11,"UGEL San Juan de Miraflores 01","0502401","329691","Primaria","San Juan de Miraflores"]
["6151 SAN LUIS GONZAGA - Secundaria",11,"UGEL San Juan de Miraflores 01","0643262","329691","Secundaria","San Juan de Miraflores"]
["7060 ANDRES AVELINO CACERES - Secundaria",12,"UGEL San Juan de Miraflores 01","0501908","329733","Secundaria","San Juan de Miraflores"]
["7060 ANDRES AVELINO CACERES - Primaria",12,"UGEL San Juan de Miraflores 01","0322958","329733","Primaria","San Juan de Miraflores"]
["FE Y ALEGRIA 65 - Inicial - Jardín",13,"UGEL San Juan de Miraflores 01","1329580","495746","Inicial - Jardín","San Juan de Miraflores"]
["FE Y ALEGRIA 65 - Primaria",13,"UGEL San Juan de Miraflores 01","1329788","495746","Primaria","San Juan de Miraflores"]
["FE Y ALEGRIA 65 - Secundaria",13,"UGEL San Juan de Miraflores 01","1376854","495746","Secundaria","San Juan de Miraflores"]
["7243 REY JUAN CARLOS DE BORBON - Primaria",14,"UGEL San Juan de Miraflores 01","1475045","687585","Primaria","Villa El Salvador"]
["7243 REY JUAN CARLOS DE BORBON - Secundaria",14,"UGEL San Juan de Miraflores 01","1475284","687585","Secundaria","Villa El Salvador"]
["624 VIRGEN DEL CARMEN - Inicial - Jardín",15,"UGEL San Juan de Miraflores 01","0704981","346327","Inicial - Jardín","Villa Maria Del Triunfo"]
["7217 OLIMPIA GERALDINA MELENDEZ PERALTA - Primaria",16,"UGEL San Juan de Miraflores 01","0764027","346799","Primaria","Villa Maria Del Triunfo"]
["7217 OLIMPIA GERALDINA MELENDEZ PERALTA - Secundaria",16,"UGEL San Juan de Miraflores 01","1474618","346799","Secundaria","Villa Maria Del Triunfo"]
["7233 MATSU UTSUMI - Secundaria",17,"UGEL San Juan de Miraflores 01","1053628","346836","Secundaria","Villa Maria Del Triunfo"]
["7233 MATSU UTSUMI - Primaria",17,"UGEL San Juan de Miraflores 01","1033729","346836","Primaria","Villa Maria Del Triunfo"]
["7233 MATSU UTSUMI - Inicial - Jardín",17,"UGEL San Juan de Miraflores 01","1518703","346836","Inicial - Jardín","Villa Maria Del Triunfo"]
["7235 MARISCAL ANDRES AVELINO CACERES - Primaria",18,"UGEL San Juan de Miraflores 01","1195882","346959","Primaria","Villa Maria Del Triunfo"]
["7235 MARISCAL ANDRES AVELINO CACERES - Inicial - Jardín",18,"UGEL San Juan de Miraflores 01","1694280","346959","Inicial - Jardín","Villa Maria Del Triunfo"]
["7231 - Primaria",19,"UGEL San Juan de Miraflores 01","0872127","346822","Primaria","Villa Maria Del Triunfo"]
["7231 - Secundaria",19,"UGEL San Juan de Miraflores 01","1195874","346822","Secundaria","Villa Maria Del Triunfo"]
["0320 - Inicial - Jardín",20,"UGEL Rimac 02","0494666","320501","Inicial - Jardín","Rimac"]
["0391-1 FLOR DE AMANCAES - Inicial - Cuna-Jardín",21,"UGEL Rimac 02","0628016","320544","Inicial - Cuna-Jardín","Rimac"]
["0391-2 SAN JUAN DE AMANCAES - Inicial - Cuna-Jardín",22,"UGEL Rimac 02","0629063","320558","Inicial - Cuna-Jardín","Rimac"]
["2002 MARISCAL RAMON CASTILLA - Secundaria",23,"UGEL Rimac 02","0581728","320638","Secundaria","Rimac"]
["2002 MARISCAL RAMON CASTILLA - Primaria",23,"UGEL Rimac 02","0436162","320638","Primaria","Rimac"]
["2063 CORONEL JOSE FELIX BOGADO - Secundaria",24,"UGEL Rimac 02","1010131","320657","Secundaria","Rimac"]
["2063 CORONEL JOSE FELIX BOGADO - Primaria",24,"UGEL Rimac 02","0566216","320657","Primaria","Rimac"]
["3010 RAMON CASTILLA - Secundaria",25,"UGEL Rimac 02","1010149","320756","Secundaria","Rimac"]
["3010 RAMON CASTILLA - Primaria",25,"UGEL Rimac 02","0217554","320756","Primaria","Rimac"]
["3012 EL ALTILLO - Primaria",26,"UGEL Rimac 02","0433474","320761","Primaria","Rimac"]
["3015 - Inicial - Jardín",27,"UGEL Rimac 02","1392539","320780","Inicial - Jardín","Rimac"]
["3017 INMACULADA CONCEPCION - Primaria",28,"UGEL Rimac 02","0433623","320799","Primaria","Rimac"]
["3017 INMACULADA CONCEPCION - Inicial - Jardín",28,"UGEL Rimac 02","1377001","320799","Inicial - Jardín","Rimac"]
["3019 PATRICIA TERESA RODRIGUEZ - Primaria",29,"UGEL Rimac 02","0433649","320817","Primaria","Rimac"]
["3019 PATRICIA TERESA RODRIGUEZ - Inicial - Jardín",29,"UGEL Rimac 02","1355718","320817","Inicial - Jardín","Rimac"]
["3075 PATRICIA FRANCISCA SILVA DE PAGADOR - Primaria",30,"UGEL Rimac 02","0596833","320836","Primaria","Rimac"]
["MERCEDES CABELLO DE CARBONERA - Secundaria",31,"UGEL Rimac 02","0334706","713546","Secundaria","Rimac"]
["NACIONAL DE MUJERES DEL RIMAC - Secundaria",32,"UGEL Rimac 02","0437293","320624","Secundaria","Rimac"]
["NACIONAL DE MUJERES DEL RIMAC - Primaria",32,"UGEL Rimac 02","1010107","320624","Primaria","Rimac"]
["3004 ESPAÑA - Secundaria",33,"UGEL Rimac 02","0663534","320704","Secundaria","Rimac"]
["3004 ESPAÑA - Primaria",33,"UGEL Rimac 02","0433326","320704","Primaria","Rimac"]
["3004 ESPAÑA - Inicial - Jardín",33,"UGEL Rimac 02","1377019","320704","Inicial - Jardín","Rimac"]
["3006 JOSE ERNESTO ECHENIQUE RODRIGUEZ - Primaria",34,"UGEL Rimac 02","0433367","320723","Primaria","Rimac"]
["3006 JOSE ERNESTO ECHENIQUE RODRIGUEZ - Inicial - Jardín",34,"UGEL Rimac 02","1627751","320723","Inicial - Jardín","Rimac"]
["3021 SAN JUAN MACIAS - Primaria",35,"UGEL Rimac 02","0433680","320822","Primaria","Rimac"]
["3021 SAN JUAN MACIAS - Inicial - Jardín",35,"UGEL Rimac 02","1376995","320822","Inicial - Jardín","Rimac"]
["CARLOS PAREJA PAZ SOLDAN - Secundaria",36,"UGEL Rimac 02","0437210","320860","Secundaria","Rimac"]
["COMUNIDAD SHIPIBA - Inicial - Jardín",37,"UGEL Rimac 02","1366483","529398","Inicial - Jardín","Rimac"]
["COMUNIDAD SHIPIBA - Primaria",37,"UGEL Rimac 02","1366491","529398","Primaria","Rimac"]
["INSTITUTO SEVILLA - Secundaria",38,"UGEL Rimac 02","0437772","321416","Secundaria","Rimac"]
["INSTITUTO SEVILLA - Primaria",38,"UGEL Rimac 02","0432906","321416","Primaria","Rimac"]
["LUCIE RYNNING DE ANTUNEZ DE MAYOLO - Secundaria",39,"UGEL Rimac 02","0437723","320841","Secundaria","Rimac"]
["3001 ESTADOS UNIDOS MEXICANOS - Primaria",40,"UGEL Rimac 02","0433243","320681","Primaria","Rimac"]
["0072 SANTA ROSITA DE LIMA - Inicial - Jardín",41,"UGEL Rimac 02","0217398","320493","Inicial - Jardín","Rimac"]
["3002-A MANUEL PARDO - Primaria",42,"UGEL Rimac 02","0433276","320695","Primaria","Rimac"]
["3003 SAN CRISTOBAL - Primaria",43,"UGEL Rimac 02","0433300","320582","Primaria","Rimac"]
["3013 - Primaria",44,"UGEL Rimac 02","0433490","320775","Primaria","Rimac"]
["0389 - Inicial - Jardín",45,"UGEL Rimac 02","0704106","320539","Inicial - Jardín","Rimac"]
["2004 - Primaria",46,"UGEL Rimac 02","0436170","320643","Primaria","Rimac"]
["2004 - Inicial - Jardín",46,"UGEL Rimac 02","1392489","320643","Inicial - Jardín","Rimac"]
["0340 - Inicial - Jardín",48,"UGEL Rimac 02","0525071","320520","Inicial - Jardín","Rimac"]
["049 - Inicial - Jardín",49,"UGEL Rimac 02","0435495","320488","Inicial - Jardín","Rimac"]
["0392-2 MADRID - Inicial - Cuna-Jardín",50,"UGEL Rimac 02","0780213","320577","Inicial - Cuna-Jardín","Rimac"]
["ESTHER CACERES SALGADO - Secundaria",51,"UGEL Rimac 02","0581710","320879","Secundaria","Rimac"]
["2074 MARIA PARADO BELLIDO - Primaria",52,"UGEL Rimac 02","0436782","320662","Primaria","Rimac"]
["2074 MARIA PARADO BELLIDO - Inicial - Jardín",52,"UGEL Rimac 02","1566611","320662","Inicial - Jardín","Rimac"]
["VIRGEN DE FATIMA - Inicial - Jardín",53,"UGEL Ate 06","1693787","777345","Inicial - Jardín","Ate"]
["VIRGEN DE FATIMA - Inicial - Cuna-Jardín",53,"UGEL Rimac 02","0743070","320884","Inicial - Cuna-Jardín","Rimac"]
["0325 - Inicial - Jardín",54,"UGEL Rimac 02","0512210","320515","Inicial - Jardín","Rimac"]
["0314 TUPAC AMARU - Inicial - Jardín",56,"UGEL Rimac 02","0435628","305690","Inicial - Jardín","Independencia"]
["0385 JOSE OLAYA - Inicial - Cuna-Jardín",57,"UGEL Rimac 02","0661595","305727","Inicial - Cuna-Jardín","Independencia"]
["2041 INCA GARCILASO DE LA VEGA - Secundaria",58,"UGEL Rimac 02","1010180","305831","Secundaria","Independencia"]
["2041 INCA GARCILASO DE LA VEGA - Primaria",58,"UGEL Rimac 02","0436477","305831","Primaria","Independencia"]
["2052 MARIA AUXILIADORA - Primaria",59,"UGEL Rimac 02","0436584","305845","Primaria","Independencia"]
["2052 MARIA AUXILIADORA - Secundaria",59,"UGEL Rimac 02","0565119","305845","Secundaria","Independencia"]
["2052 MARIA AUXILIADORA - Inicial - Jardín",59,"UGEL Rimac 02","1377043","305845","Inicial - Jardín","Independencia"]
["2057 JOSE GABRIEL CONDORCANQUI - Secundaria",60,"UGEL Rimac 02","0565176","305888","Secundaria","Independencia"]
["2057 JOSE GABRIEL CONDORCANQUI - Primaria",60,"UGEL Rimac 02","0436626","305888","Primaria","Independencia"]
["0324 SAN JUDAS TADEO - Inicial - Jardín",62,"UGEL Rimac 02","0435602","305713","Inicial - Jardín","Independencia"]
["0390-3 TAHUANTINSUYO - Inicial - Cuna-Jardín",64,"UGEL Rimac 02","0661579","305770","Inicial - Cuna-Jardín","Independencia"]
["2058 VIRGEN DE LA MEDALLA MILAGROSA - Primaria",65,"UGEL Rimac 02","0436634","305893","Primaria","Independencia"]
["2058 VIRGEN DE LA MEDALLA MILAGROSA - Inicial - Jardín",65,"UGEL Rimac 02","1377035","305893","Inicial - Jardín","Independencia"]
["3049 IMPERIO DEL TAHUANTINSUYO - Secundaria",66,"UGEL Rimac 02","0565234","305925","Secundaria","Independencia"]
["3049 IMPERIO DEL TAHUANTINSUYO - Primaria",66,"UGEL Rimac 02","0434258","305925","Primaria","Independencia"]
["3049 IMPERIO DEL TAHUANTINSUYO - Inicial - Jardín",66,"UGEL Rimac 02","1261668","305925","Inicial - Jardín","Independencia"]
["3056 GRAN BRETAÑA - Secundaria",67,"UGEL Rimac 02","0565267","305973","Secundaria","Independencia"]
["3056 GRAN BRETAÑA - Primaria",67,"UGEL Rimac 02","0434423","305973","Primaria","Independencia"]
["3094-1 - Primaria",68,"UGEL Rimac 02","0780783","305671","Primaria","Independencia"]
["0386 VICTOR RAUL HAYA DE LA TORRE - Inicial - Jardín",69,"UGEL Rimac 02","0662031","305732","Inicial - Jardín","Independencia"]
["TAHUANTINSUYO - Educación Especial",71,"UGEL Rimac 02","0436915","306034","Educación Especial","Independencia"]
["3056 GRAN BRETAÑA - Secundaria",72,"UGEL Rimac 02","0565267","305973","Secundaria","Independencia"]
["3056 GRAN BRETAÑA - Primaria",72,"UGEL Rimac 02","0434423","305973","Primaria","Independencia"]
["SANTA MARIA MAZZARELLO - CETPRO",73,"UGEL Rimac 02","0763623","306029","CETPRO","Independencia"]
["0319 - Inicial - Jardín",74,"UGEL Rimac 02","0496018","305708","Inicial - Jardín","Independencia"]
["0055 SAGRADO CORAZON DE JESUS - Inicial - Cuna-Jardín",75,"UGEL Rimac 02","0435511","305685","Inicial - Cuna-Jardín","Independencia"]
["0390-6 VIRGEN DE FATIMA - Inicial - Jardín",76,"UGEL Rimac 02","1010057","305794","Inicial - Jardín","Independencia"]
["0392 - Inicial - Jardín",77,"UGEL Rimac 02","0725689","305746","Inicial - Jardín","Independencia"]
["2034 REPUBLICA DE IRLANDA - Secundaria",78,"UGEL Rimac 02","0743179","305807","Secundaria","Independencia"]
["2034 REPUBLICA DE IRLANDA - Primaria",78,"UGEL Rimac 02","0819581","305807","Primaria","Independencia"]
["2036 MARIA AUXILIADORA - Primaria",79,"UGEL Rimac 02","0436428","305812","Primaria","Independencia"]
["2036 MARIA AUXILIADORA - Inicial - Jardín",79,"UGEL Rimac 02","1377027","305812","Inicial - Jardín","Independencia"]
{"$rows_left_out":409}